Target
Aminopeptidase B
Ligand
BDBM50339784
Substrate
Meas. Tech.
ChEMBL_1344423 (CHEMBL3258373)
IC50
420±n/a nM
Citation
 Nishizawa, RSaino, TTakita, TSuda, HAoyagi, T Synthesis and structure-activity relationships of bestatin analogues, inhibitors of aminopeptidase B. J Med Chem 20:510-5 (1977)  
Target
Name:
Aminopeptidase B
Synonyms:
AMPB_RAT Arginine aminopeptidase Cytosol aminopeptidase IV | Rnpep
Type:
PROTEIN
Mol. Mass.:
72609.93
Organism:
Rattus norvegicus
Description:
ChEMBL_1344423
Residue:
650
  
Inhibitor
Name:
BDBM50339784
Synonyms:
(S)-2-((2S,3R)-3-amino-2-hydroxy-4-phenylbutanamido)hexanoic acid | CHEMBL1689148
Type:
Small organic molecule
Emp. Form.:
C16H24N2O4
Mol. Mass.:
308.3728
SMILES:
CCCC[C@H](NC(=O)[C@@H](O)[C@H](N)Cc1ccccc1)C(O)=O
: