Target
D(1A) dopamine receptor
Ligand
BDBM50004822
Substrate
Meas. Tech.
ChEMBL_1353324 (CHEMBL3267826)
Ki
73±n/a nM
Citation
 Liu, ZAi, JPeng, XSong, ZWu, KZhang, JYao, QChen, YJi, YYang, YGeng, MZhang, A Novel 2,4-Diarylaminopyrimidine Analogues (DAAPalogues) Showing Potent c-Met/ALK Multikinase Inhibitory Activities. ACS Med Chem Lett 5:304-8 (2014)  
Target
Name:
D(1A) dopamine receptor
Synonyms:
DA D1 receptor DRD1 Dopamine D1 receptor Dopamine D1A
Type:
Enzyme
Mol. Mass.:
49303.43
Organism:
Homo sapiens (Human)
Description:
P21728
Residue:
446
  
Inhibitor
Name:
BDBM50004822
Synonyms:
(R)-1-phenyl-2,3,4,5-tetrahydro-1H-benzo[d]azepine-7,8-diol 1-Phenyl-2,3,4,5-tetrahydro-1H-benzo[d]azepine-7,8-diol 7,8-Dihydroxy-1-phenyl-2,3,4,5-tetrahydro-1H-benzo[d]azepinium(R(+)SKF38393) CHEMBL24077 SK&F-383933 SK-383933 SKF 38393 (+)
Type:
Small organic molecule
Emp. Form.:
C16H17NO2
Mol. Mass.:
255.3117
SMILES:
Oc1cc2CCNC[C@H](c3ccccc3)c2cc1O
: