Target
Angiotensin-converting enzyme
Ligand
BDBM50010478
Substrate
Meas. Tech.
ChEMBL_1353478 (CHEMBL3269461)
Ki
33±n/a nM
Citation
 Kramer, GJMohd, ASchwager, SLMasuyer, GAcharya, KRSturrock, EDBachmann, BO Interkingdom pharmacology of Angiotensin-I converting enzyme inhibitor phosphonates produced by actinomycetes. ACS Med Chem Lett 5:346-51 (2014)  
Target
Name:
Angiotensin-converting enzyme
Synonyms:
ACE Angiotensin converting enzyme (ACE) Angiotensin-converting enzyme, soluble form CD_antigen=CD143 DCP1 Kininase II
Type:
Enzyme
Mol. Mass.:
149709.01
Organism:
Homo sapiens (Human)
Description:
Residue:
1306
  
Inhibitor
Name:
BDBM50010478
Synonyms:
CHEMBL3264009
Type:
Small organic molecule
Emp. Form.:
C22H36N3O7P
Mol. Mass.:
485.5109
SMILES:
CC[C@H](C)[C@H](NC(C)=O)C(=O)N[C@@H](CC(C)C)C(=O)N[C@@H](Cc1ccc(O)cc1)P(O)(O)=O
: