Target
Cathepsin D
Ligand
BDBM50010845
Substrate
Meas. Tech.
ChEMBL_1353681 (CHEMBL3271470)
IC50
360±n/a nM
Citation
 Jaudzems, KTars, KMaurops, GIvdra, NOtikovs, MLeitans, JKanepe-Lapsa, IDomraceva, IMutule, ITrapencieris, PBlackman, MJJirgensons, A Plasmepsin inhibitory activity and structure-guided optimization of a potent hydroxyethylamine-based antimalarial hit. ACS Med Chem Lett 5:373-7 (2014)  
Target
Name:
Cathepsin D
Synonyms:
CATD_HUMAN CTSD Cathepsin D heavy chain Cathepsin D precursor
Type:
Enzyme
Mol. Mass.:
44551.72
Organism:
Homo sapiens (Human)
Description:
Human proCathepsin D (SwissProt accession number P07339) was expressed in Sf9 cells, purified, and autoactivated.
Residue:
412
  
Inhibitor
Name:
BDBM50010845
Synonyms:
CHEMBL581498 | TCMDC-138893
Type:
Small organic molecule
Emp. Form.:
C36H48N4O6S
Mol. Mass.:
664.855
SMILES:
CCCN(CCC)C(=O)c1cc(cc(c1)C(=O)N[C@@H](Cc1ccccc1)[C@H](O)CNCc1cccc(OC)c1)N1CCCCS1(=O)=O
: