Target
Proteasome subunit beta type-7
Ligand
BDBM50010992
Substrate
Meas. Tech.
ChEMBL_1351351 (CHEMBL3266564)
EC50
4200±n/a nM
Citation
 Fan, HAngelo, NGWarren, JDNathan, CFLin, G Oxathiazolones Selectively Inhibit the Human Immunoproteasome over the Constitutive Proteasome. ACS Med Chem Lett 5:405-10 (2014)  
Target
Name:
Proteasome subunit beta type-7
Synonyms:
Macropain chain Z PSB7_HUMAN Proteasome subunit Z | Z
Type:
PROTEIN
Mol. Mass.:
29968.13
Organism:
Homo sapiens (Human)
Description:
ChEMBL_106197
Residue:
277
  
Inhibitor
Name:
BDBM50010992
Synonyms:
CHEMBL3259883
Type:
Small organic molecule
Emp. Form.:
C10H8N2O3S
Mol. Mass.:
236.247
SMILES:
CC(=O)Nc1cccc(c1)-c1nsc(=O)o1
: