Target
eIF-2-alpha kinase GCN2
Ligand
BDBM50011232
Substrate
Meas. Tech.
ChEMBL_1351815 (CHEMBL3271321)
IC50
<300±n/a nM
Citation
 Brazeau, JFRosse, G Triazolo[4,5-d]pyrimidine Derivatives as Inhibitors of GCN2. ACS Med Chem Lett 5:282-3 (2014)  
Target
Name:
eIF-2-alpha kinase GCN2
Synonyms:
E2AK4_HUMAN Eukaryotic translation initiation factor 2-alpha kinase 4 GCN2(Kin.Dom.2 S808G) KIAA1338
Type:
PROTEIN
Mol. Mass.:
186899.26
Organism:
Homo sapiens (Human)
Description:
ChEMBL_1495738
Residue:
1649
  
Inhibitor
Name:
BDBM50011232
Synonyms:
CHEMBL3260332
Type:
Small organic molecule
Emp. Form.:
C23H29N9O
Mol. Mass.:
447.5361
SMILES:
CCOc1ccc(cc1)-n1nnc2nc(Nc3ccn(CCCC4CCNCC4)n3)ncc12
: