Target
Adenosine receptor A2b
Ligand
BDBM50119132
Substrate
Meas. Tech.
ChEMBL_1352074 (CHEMBL3267339)
EC50
10000±n/a nM
Citation
 de Lera Ruiz, MLim, YHZheng, J Adenosine A2A receptor as a drug discovery target. J Med Chem 57:3623-50 (2014)  
Target
Name:
Adenosine receptor A2b
Synonyms:
AA2BR_HUMAN ADORA2B Adenosine receptors A2b | Adenosine receptors; A2a & A2b
Type:
G Protein-Coupled Receptor (GPCR)
Mol. Mass.:
36341.22
Organism:
Homo sapiens (Human)
Description:
Residue:
332
  
Inhibitor
Name:
BDBM50119132
Synonyms:
1-[6-Amino-9-((2R,3R,4S,5R)-3,4-dihydroxy-5-hydroxymethyl-tetrahydro-furan-2-yl)-9H-purin-2-yl]-1H-pyrazole-4-carboxylic acid methylamide REGADENOSON
Type:
Small organic molecule
Emp. Form.:
C15H18N8O5
Mol. Mass.:
390.354
SMILES:
CNC(=O)c1cnn(c1)-c1nc(N)c2ncn([C@@H]3O[C@H](CO)[C@@H](O)[C@H]3O)c2n1
: