Target
Adenosine receptor A2b
Ligand
BDBM50004566
Substrate
Meas. Tech.
ChEMBL_1352081 (CHEMBL3267346)
Ki
44±n/a nM
Citation
 de Lera Ruiz, MLim, YHZheng, J Adenosine A2A receptor as a drug discovery target. J Med Chem 57:3623-50 (2014)  
Target
Name:
Adenosine receptor A2b
Synonyms:
AA2BR_HUMAN ADORA2B Adenosine receptors A2b | Adenosine receptors; A2a & A2b
Type:
G Protein-Coupled Receptor (GPCR)
Mol. Mass.:
36341.22
Organism:
Homo sapiens (Human)
Description:
Residue:
332
  
Inhibitor
Name:
BDBM50004566
Synonyms:
9-Chloro-2-furan-2-yl-[1,2,4]triazolo[1,5-c]quinazolin-5-ylamine 9-Chloro-[1,2,4]triazolo[1,5-c]quinazolin-5-ylamine(CGS 15943) 9-chloro-2-(furan-2-yl)-[1,2,4]triazolo[1,5-c]quinazolin-5-amine CHEMBL16687 Nonnucleoside analog, 4
Type:
Small organic molecule
Emp. Form.:
C13H8ClN5O
Mol. Mass.:
285.689
SMILES:
Nc1nc2ccc(Cl)cc2c2nc(nn12)-c1ccco1
: