Target
Translocator protein
Ligand
BDBM50011488
Substrate
Meas. Tech.
ChEMBL_1352881 (CHEMBL3269398)
Ki
2.6±n/a nM
Citation
 Castellano, STaliani, SViviano, MMilite, CDa Pozzo, ECosta, BBarresi, EBruno, ACosconati, SMarinelli, LGreco, GNovellino, ESbardella, GDa Settimo, FMartini, C Structure-activity relationship refinement and further assessment of 4-phenylquinazoline-2-carboxamide translocator protein ligands as antiproliferative agents in human glioblastoma tumors. J Med Chem 57:2413-28 (2014)  
Target
Name:
Translocator protein
Synonyms:
Benzodiazepine receptors; peripheral & central Mbr PBR Peripheral benzodiazepine receptor (PBR) TSPO_RAT | Tspo
Type:
Mitochondrion membrane protein
Mol. Mass.:
18945.84
Organism:
Rattus norvegicus (rat)
Description:
Competitive binding experiments were performed on rat kidney mitochondrial membranes.
Residue:
169
  
Inhibitor
Name:
BDBM50011488
Synonyms:
CHEMBL3261898
Type:
Small organic molecule
Emp. Form.:
C25H23N3O
Mol. Mass.:
381.4696
SMILES:
CCN(Cc1ccc(C)cc1)C(=O)c1nc(-c2ccccc2)c2ccccc2n1
: