Target
Polyunsaturated fatty acid lipoxygenase ALOX15
Ligand
BDBM79800
Substrate
Meas. Tech.
ChEMBL_1352303 (CHEMBL3269367)
IC50
>50000±n/a nM
Citation
 Rai, GJoshi, NJung, JELiu, YSchultz, LYasgar, APerry, SDiaz, GZhang, QKenyon, VJadhav, ASimeonov, ALo, EHvan Leyen, KMaloney, DJHolman, TR Potent and selective inhibitors of human reticulocyte 12/15-lipoxygenase as anti-stroke therapies. J Med Chem 57:4035-48 (2014)  
Target
Name:
Polyunsaturated fatty acid lipoxygenase ALOX15
Synonyms:
15-Lipoxygenase-1 (15-LOX-1) Arachidonate 15-lipoxygenase LOG15 Reticulocyte 15-lipoxygenase-1 | Sphingosine 1-phosphate receptor 1 (S1P1)
Type:
Protein
Mol. Mass.:
74804.05
Organism:
Homo sapiens (Human)
Description:
Residue:
662
  
Inhibitor
Name:
BDBM79800
Synonyms:
5-(methylamino)-2-(1-naphthalenyl)-4-oxazolecarbonitrile 5-(methylamino)-2-naphthalen-1-yl-1,3-oxazole-4-carbonitrile SMR000045344 | cid_664510
Type:
Small organic molecule
Emp. Form.:
C15H11N3O
Mol. Mass.:
249.2673
SMILES:
CNc1oc(nc1C#N)-c1cccc2ccccc12
: