Target
Kappa-type opioid receptor
Ligand
BDBM50350976
Substrate
Meas. Tech.
ChEMBL_1352780 (CHEMBL3268180)
Ki
1.2±n/a nM
Citation
 Urbano, MGuerrero, MRosen, HRoberts, E Antagonists of the kappa opioid receptor. Bioorg Med Chem Lett 24:2021-32 (2014)  
Target
Name:
Kappa-type opioid receptor
Synonyms:
K-OR-1 Kappa-opioid receptor (KOR) Kappa-type opioid receptor (KOR) OPIATE Kappa OPRK1 kappa opioid receptor (KOR)
Type:
G Protein-Coupled Receptor (GPCR)
Mol. Mass.:
42648.76
Organism:
Homo sapiens (Human)
Description:
P41145
Residue:
380
  
Inhibitor
Name:
BDBM50350976
Synonyms:
CHEMBL1818341
Type:
Small organic molecule
Emp. Form.:
C21H28N2O2S
Mol. Mass.:
372.524
SMILES:
CC(C)CNCc1ccc(cc1)-c1ccccc1S(=O)(=O)N1CCCC1
: