Target
Mu-type opioid receptor
Ligand
BDBM50350976
Substrate
Meas. Tech.
ChEMBL_1352781 (CHEMBL3268181)
Ki
10.0±n/a nM
Citation
 Urbano, MGuerrero, MRosen, HRoberts, E Antagonists of the kappa opioid receptor. Bioorg Med Chem Lett 24:2021-32 (2014)  
Target
Name:
Mu-type opioid receptor
Synonyms:
M-OR-1 MOR-1 MUOR1 Mu opiate receptor OPRM1 hMOP | mu-type opioid receptor isoform MOR-1
Type:
G Protein-Coupled Receptor (GPCR)
Mol. Mass.:
44789.51
Organism:
Homo sapiens (Human)
Description:
P35372
Residue:
400
  
Inhibitor
Name:
BDBM50350976
Synonyms:
CHEMBL1818341
Type:
Small organic molecule
Emp. Form.:
C21H28N2O2S
Mol. Mass.:
372.524
SMILES:
CC(C)CNCc1ccc(cc1)-c1ccccc1S(=O)(=O)N1CCCC1
: