Target
Delta-type opioid receptor
Ligand
BDBM71567
Substrate
Meas. Tech.
ChEMBL_1352796 (CHEMBL3268196)
IC50
>32000±n/a nM
Citation
 Urbano, MGuerrero, MRosen, HRoberts, E Antagonists of the kappa opioid receptor. Bioorg Med Chem Lett 24:2021-32 (2014)  
Target
Name:
Delta-type opioid receptor
Synonyms:
D-OR-1 Delta opioid receptor OPIATE Delta OPRD1 OPRK1 | opioid receptor, delta 1
Type:
G Protein-Coupled Receptor (GPCR)
Mol. Mass.:
40382.98
Organism:
Homo sapiens (Human)
Description:
Competition binding assays were carried out using membrane preparations from transfected HN9.10 cells that constitutively expressed the delta opioid receptor.
Residue:
372
  
Inhibitor
Name:
BDBM71567
Synonyms:
KSC-11-23-1 N-[2-[benzyl(ethyl)amino]ethyl]-4-[(tosylamino)methyl]benzamide N-[2-[ethyl-(phenylmethyl)amino]ethyl]-4-[[(4-methylphenyl)sulfonylamino]methyl]benzamide | cid_44608034
Type:
Small organic molecule
Emp. Form.:
C26H31N3O3S
Mol. Mass.:
465.608
SMILES:
CCN(CCNC(=O)c1ccc(CNS(=O)(=O)c2ccc(C)cc2)cc1)Cc1ccccc1
: