Target
Mu-type opioid receptor
Ligand
BDBM50012152
Substrate
Meas. Tech.
ChEMBL_1352784 (CHEMBL3268184)
Ki
27±n/a nM
Citation
 Urbano, MGuerrero, MRosen, HRoberts, E Antagonists of the kappa opioid receptor. Bioorg Med Chem Lett 24:2021-32 (2014)  
Target
Name:
Mu-type opioid receptor
Synonyms:
M-OR-1 MOR-1 MUOR1 Mu opiate receptor OPRM1 hMOP | mu-type opioid receptor isoform MOR-1
Type:
G Protein-Coupled Receptor (GPCR)
Mol. Mass.:
44789.51
Organism:
Homo sapiens (Human)
Description:
P35372
Residue:
400
  
Inhibitor
Name:
BDBM50012152
Synonyms:
CHEMBL3264441
Type:
Small organic molecule
Emp. Form.:
C28H36N2O6
Mol. Mass.:
496.5952
SMILES:
CCOC(=O)C(CN1CC[C@](C)([C@@H](C)C1)c1cccc(O)c1)OC(=O)[C@H]1Cc2ccc(O)cc2CN1
: