Target
Polyunsaturated fatty acid 5-lipoxygenase
Ligand
BDBM50132003
Substrate
Meas. Tech.
ChEMBL_1353585 (CHEMBL3270666)
IC50
15000±n/a nM
Citation
 Pergola, CGaboriaud-Kolar, NJestädt, NKönig, SKritsanida, MSchaible, AMLi, HGarscha, UWeinigel, CBarz, DAlbring, KFHuber, OSkaltsounis, ALWerz, O Indirubin core structure of glycogen synthase kinase-3 inhibitors as novel chemotype for intervention with 5-lipoxygenase. J Med Chem 57:3715-23 (2014)  
Target
Name:
Polyunsaturated fatty acid 5-lipoxygenase
Synonyms:
5-LO 5-Lipoxygenase (5-LO) 5-Lipoygenase ALOX5 LOG5 | LOX5_HUMAN
Type:
Enzyme
Mol. Mass.:
77972.74
Organism:
Homo sapiens (Human)
Description:
Recombinant protein was purified from E. coli lysate. After ammonium sulfate precipitation and subsequent steps, the supernatant (S100) was used for 5-LO activity assay.
Residue:
674
  
Inhibitor
Name:
BDBM50132003
Synonyms:
(Z)-1H,1''H-[2,3'']Biindolylidene-3,2''-dione 3-oxime 1H,1''H-[2,3'']Biindolylidene-3,2''-dione 3-oxime 3-(3-(hydroxyimino)indolin-2-ylidene)indolin-2-one | CHEMBL126077
Type:
Small organic molecule
Emp. Form.:
C16H11N3O2
Mol. Mass.:
277.2774
SMILES:
Oc1[nH]c2ccccc2c1-c1[nH]c2ccccc2c1N=O
: