Target
Prostaglandin E2 receptor EP4 subtype
Ligand
BDBM50012511
Substrate
Meas. Tech.
ChEMBL_1351394 (CHEMBL3266970)
Ki
20±n/a nM
Citation
 Sutton, JClark, DEHiggs, Cde Groot, MJHarris, NVTaylor, ALockey, PMMaubach, KWoodrooffe, ADavis, RJColeman, RAClark, KL From virtual to clinical: The discovery of PGN-1531, a novel antagonist of the prostanoid EP4 receptor. Bioorg Med Chem Lett 24:2212-21 (2014)  
Target
Name:
Prostaglandin E2 receptor EP4 subtype
Synonyms:
PE2R4_HUMAN PGE2 receptor EP4 subtype PTGER4 Prostanoid EP4 receptor
Type:
Enzyme
Mol. Mass.:
53134.53
Organism:
Homo sapiens (Human)
Description:
P35408
Residue:
488
  
Inhibitor
Name:
BDBM50012511
Synonyms:
CHEMBL3260459
Type:
Small organic molecule
Emp. Form.:
C27H23NO6S
Mol. Mass.:
489.54
SMILES:
CC(=O)c1ccc(cc1)-c1ccc(OCc2cc(oc2C)C(=O)NS(=O)(=O)c2ccccc2)cc1
: