Target
Beta-secretase 1
Ligand
BDBM116236
Substrate
Meas. Tech.
ChEMBL_1351652 (CHEMBL3269339)
IC50
77±n/a nM
Citation
 Oehlrich, DProkopcova, HGijsen, HJ The evolution of amidine-based brain penetrant BACE1 inhibitors. Bioorg Med Chem Lett 24:2033-45 (2014)  
Target
Name:
Beta-secretase 1
Synonyms:
ASP2 Aspartyl protease 2 BACE1 Beta-secretase (BACE) Beta-secretase 1 (BACE 1) Beta-secretase 1 (BACE1) Beta-site amyloid precursor protein cleaving enzyme 1 Memapsin-2 beta-Secretase (BACE-1) | beta-Secretase (BACE1)
Type:
Protein
Mol. Mass.:
55755.10
Organism:
Homo sapiens (Human)
Description:
P56817
Residue:
501
  
Inhibitor
Name:
BDBM116236
Synonyms:
US10035794, Example 11 US8637508, 11
Type:
Small organic molecule
Emp. Form.:
C20H18F4N6O2
Mol. Mass.:
450.3895
SMILES:
Cc1cc(cnc1C(=O)Nc1ccc(F)c(n1)[C@]1(C)CO[C@](C)(C(N)=N1)C(F)(F)F)C#N
: