Target
P2Y purinoceptor 2
Ligand
BDBM50013011
Substrate
Meas. Tech.
ChEMBL_1351702 (CHEMBL3270102)
EC50
168±n/a nM
Citation
 Jayasekara, PSBarrett, MOBall, CBBrown, KAHammes, EBalasubramanian, RHarden, TKJacobson, KA 4-Alkyloxyimino derivatives of uridine-5'-triphosphate: distal modification of potent agonists as a strategy for molecular probes of P2Y2, P2Y4, and P2Y6 receptors. J Med Chem 57:3874-83 (2014)  
Target
Name:
P2Y purinoceptor 2
Synonyms:
ATP receptor P2RY2 P2U purinoceptor 1 P2Y purinoceptor 2 Purinergic receptor | Purinergic receptor P2Y2
Type:
PROTEIN
Mol. Mass.:
42299.21
Organism:
Homo sapiens (Human)
Description:
ChEMBL_1455361
Residue:
377
  
Inhibitor
Name:
BDBM50013011
Synonyms:
CHEMBL3261373
Type:
Small organic molecule
Emp. Form.:
C14H22N3O15P3
Mol. Mass.:
565.2569
SMILES:
O[C@@H]1[C@@H](COP(O)(=O)OP(O)(=O)OP(O)(O)=O)O[C@H]([C@@H]1O)n1cc\c(=N\OCCCC#C)[nH]c1=O
: