Target
P2Y purinoceptor 4
Ligand
BDBM50013013
Substrate
Meas. Tech.
ChEMBL_1351703 (CHEMBL3270103)
EC50
47±n/a nM
Citation
 Jayasekara, PSBarrett, MOBall, CBBrown, KAHammes, EBalasubramanian, RHarden, TKJacobson, KA 4-Alkyloxyimino derivatives of uridine-5'-triphosphate: distal modification of potent agonists as a strategy for molecular probes of P2Y2, P2Y4, and P2Y6 receptors. J Med Chem 57:3874-83 (2014)  
Target
Name:
P2Y purinoceptor 4
Synonyms:
NRU P2RY4 P2Y purinoceptor 4 Pyrimidinergic receptor P2Y4 Uridine nucleotide receptor
Type:
PROTEIN
Mol. Mass.:
40977.17
Organism:
Homo sapiens (Human)
Description:
ChEMBL_751027
Residue:
365
  
Inhibitor
Name:
BDBM50013013
Synonyms:
CHEMBL3261375
Type:
Small organic molecule
Emp. Form.:
C25H29N4O15P3
Mol. Mass.:
718.4368
SMILES:
O[C@@H]1[C@@H](COP(O)(=O)OP(O)(=O)OP(O)(O)=O)O[C@H]([C@@H]1O)n1cc\c(=N\OCCC(C#N)(c2ccccc2)c2ccccc2)[nH]c1=O
: