Target
P2Y purinoceptor 6
Ligand
BDBM50012958
Substrate
Meas. Tech.
ChEMBL_1351704 (CHEMBL3270104)
EC50
539±n/a nM
Citation
 Jayasekara, PSBarrett, MOBall, CBBrown, KAHammes, EBalasubramanian, RHarden, TKJacobson, KA 4-Alkyloxyimino derivatives of uridine-5'-triphosphate: distal modification of potent agonists as a strategy for molecular probes of P2Y2, P2Y4, and P2Y6 receptors. J Med Chem 57:3874-83 (2014)  
Target
Name:
P2Y purinoceptor 6
Synonyms:
P2RY6 P2Y purinoceptor 6 Pyrimidinergic receptor P2Y6
Type:
PROTEIN
Mol. Mass.:
36452.29
Organism:
Homo sapiens (Human)
Description:
ChEMBL_1511151
Residue:
328
  
Inhibitor
Name:
BDBM50012958
Synonyms:
CHEMBL3261362
Type:
Small organic molecule
Emp. Form.:
C18H25FN3O15P3
Mol. Mass.:
635.3219
SMILES:
O[C@@H]1[C@@H](COP(O)(=O)OP(O)(=O)OP(O)(O)=O)O[C@H]([C@@H]1O)n1cc\c(=N\OCCCc2cccc(F)c2)[nH]c1=O
: