Target
Progesterone receptor
Ligand
BDBM50013427
Substrate
Meas. Tech.
ChEMBL_1349005 (CHEMBL3266003)
IC50
1520±n/a nM
Citation
 Casimiro-Garcia, APiotrowski, DWAmbler, CArhancet, GBBanker, MEBanks, TBoustany-Kari, CMCai, CChen, XEudy, RHepworth, DHulford, CAJennings, SMLoria, PMMeyers, MJPetersen, DNRaheja, NKSammons, MShe, LSong, KVrieze, DWei, L Identification of (R)-6-(1-(4-cyano-3-methylphenyl)-5-cyclopentyl-4,5-dihydro-1H-pyrazol-3-yl)-2-methoxynicotinic acid, a highly potent and selective nonsteroidal mineralocorticoid receptor antagonist. J Med Chem 57:4273-88 (2014)  
Target
Name:
Progesterone receptor
Synonyms:
NR3C3 PGR PRGR_HUMAN | progesterone
Type:
Protein
Mol. Mass.:
98979.52
Organism:
Homo sapiens (Human)
Description:
P06401
Residue:
933
  
Inhibitor
Name:
BDBM50013427
Synonyms:
CHEMBL3263765
Type:
Small organic molecule
Emp. Form.:
C24H28N6O2
Mol. Mass.:
432.5181
SMILES:
COc1nc(ccc1C(=O)N(C)C)C1=NN([C@H](C1)C1CCCC1)c1ccc(C#N)c(C)n1
: