Target
Glucocorticoid receptor
Ligand
BDBM50013428
Substrate
Meas. Tech.
ChEMBL_1349006 (CHEMBL3266004)
IC50
>10000±n/a nM
Citation
 Casimiro-Garcia, APiotrowski, DWAmbler, CArhancet, GBBanker, MEBanks, TBoustany-Kari, CMCai, CChen, XEudy, RHepworth, DHulford, CAJennings, SMLoria, PMMeyers, MJPetersen, DNRaheja, NKSammons, MShe, LSong, KVrieze, DWei, L Identification of (R)-6-(1-(4-cyano-3-methylphenyl)-5-cyclopentyl-4,5-dihydro-1H-pyrazol-3-yl)-2-methoxynicotinic acid, a highly potent and selective nonsteroidal mineralocorticoid receptor antagonist. J Med Chem 57:4273-88 (2014)  
Target
Name:
Glucocorticoid receptor
Synonyms:
GCR_HUMAN GRL Glucocorticoid receptor (GRFP) Nuclear receptor subfamily 3 group C member 1
Type:
Enzyme
Mol. Mass.:
85656.87
Organism:
Homo sapiens (Human)
Description:
P04150
Residue:
777
  
Inhibitor
Name:
BDBM50013428
Synonyms:
CHEMBL3263766
Type:
Small organic molecule
Emp. Form.:
C24H27N5O4S
Mol. Mass.:
481.567
SMILES:
COc1nc(ccc1C(=O)NS(C)(=O)=O)C1=NN([C@H](C1)C1CCCC1)c1ccc(C#N)c(C)c1
: