Target
Androgen receptor
Ligand
BDBM50324201
Substrate
Meas. Tech.
ChEMBL_1349007 (CHEMBL3266005)
IC50
>10000±n/a nM
Citation
 Casimiro-Garcia, APiotrowski, DWAmbler, CArhancet, GBBanker, MEBanks, TBoustany-Kari, CMCai, CChen, XEudy, RHepworth, DHulford, CAJennings, SMLoria, PMMeyers, MJPetersen, DNRaheja, NKSammons, MShe, LSong, KVrieze, DWei, L Identification of (R)-6-(1-(4-cyano-3-methylphenyl)-5-cyclopentyl-4,5-dihydro-1H-pyrazol-3-yl)-2-methoxynicotinic acid, a highly potent and selective nonsteroidal mineralocorticoid receptor antagonist. J Med Chem 57:4273-88 (2014)  
Target
Name:
Androgen receptor
Synonyms:
ANDR_HUMAN Androgen Receptor Androgen receptor/Baculoviral IAP repeat-containing protein 2 Dihydrotestosterone receptor Nuclear receptor subfamily 3 group C member 4
Type:
Receptor
Mol. Mass.:
99185.27
Organism:
Homo sapiens (Human)
Description:
CHO cells were stably transfected with human AR gene.
Residue:
920
  
Inhibitor
Name:
BDBM50324201
Synonyms:
4-[(5R)-1-(3-Chloro-4-cyanophenyl)-5-cyclopentyl-4,5-dihydro-1H-pyrazol-3-yl]-2-ethoxybenzoic Acid | CHEMBL1215197
Type:
Small organic molecule
Emp. Form.:
C24H24ClN3O3
Mol. Mass.:
437.919
SMILES:
CCOc1cc(ccc1C(O)=O)C1=NN([C@H](C1)C1CCCC1)c1ccc(C#N)c(Cl)c1
: