Target
Dual specificity mitogen-activated protein kinase kinase 1
Ligand
BDBM50014413
Substrate
Meas. Tech.
ChEMBL_1350727 (CHEMBL3266112)
IC50
1.6±n/a nM
Citation
 Lu, HTu, WFei, HXu, GHu, QZhang, LLin, BYuan, JYin, JGong, AWan, MWang, DZhu, XFeng, JWang, QSun, P Structure-based design and synthesis of bicyclic fused-pyridines as MEK inhibitors. Bioorg Med Chem Lett 24:2555-9 (2014)  
Target
Name:
Dual specificity mitogen-activated protein kinase kinase 1
Synonyms:
Dual specificity mitogen-activated protein kinase (MEK) Dual specificity mitogen-activated protein kinase kinase 1 (MEK1) Dual specificity mitogen-activated protein kinase kinase MEK1/2 MAP kinase kinase 1 MAPK/ERK kinase 1 MEK-1 MP2K1_HUMAN PRKMK1 | VHL-MAP2K1/MAP2K2
Type:
Other Protein Type
Mol. Mass.:
43439.03
Organism:
Homo sapiens (Human)
Description:
Full-length human MEK-1 was generated by PCR and purified as a fusion protein from Escherichia coli lysates.
Residue:
393
  
Inhibitor
Name:
BDBM50014413
Synonyms:
CHEMBL3261161
Type:
Small organic molecule
Emp. Form.:
C16H14FIN4O3
Mol. Mass.:
456.2102
SMILES:
OC[C@@H](O)Cn1ncc2cncc(Nc3ccc(I)cc3F)c2c1=O
: