Target
5-hydroxytryptamine receptor 3A
Ligand
BDBM50014549
Substrate
Meas. Tech.
ChEMBL_1350968 (CHEMBL3268497)
Ki
0.200000±n/a nM
Citation
 Manning, DDGuo, CZhang, ZRyan, KNNaginskaya, JChoo, SHMasih, LEarley, WGWierschke, JDNewman, ASBrady, CABarnes, NMGuzzo, PR The discovery of diazepinone-based 5-HT3 receptor partial agonists. Bioorg Med Chem Lett 24:2578-81 (2014)  
Target
Name:
5-hydroxytryptamine receptor 3A
Synonyms:
5-HT-3 5-HT3A 5-hydroxytryptamine receptor 3 (5-HT3) 5-hydroxytryptamine receptor 3A (5HT3A) 5HT3R HTR3A Serotonin 3 receptor (5HT3) Serotonin-gated ion channel receptor | Serotonin-gated ion channel receptor 3
Type:
Protein
Mol. Mass.:
55283.27
Organism:
Homo sapiens (Human)
Description:
P46098
Residue:
478
  
Inhibitor
Name:
BDBM50014549
Synonyms:
CHEMBL3261480 | US9045501, 4
Type:
Small organic molecule
Emp. Form.:
C19H22ClN3O
Mol. Mass.:
343.85
SMILES:
Cc1cn2CCN([C@@H]3CN4CCC3CC4)C(=O)c3cc(Cl)cc1c23
: