Target
Cytochrome P450 2D6
Ligand
BDBM50014552
Substrate
Meas. Tech.
ChEMBL_1350977 (CHEMBL3268876)
IC50
>50000±n/a nM
Citation
 Manning, DDGuo, CZhang, ZRyan, KNNaginskaya, JChoo, SHMasih, LEarley, WGWierschke, JDNewman, ASBrady, CABarnes, NMGuzzo, PR The discovery of diazepinone-based 5-HT3 receptor partial agonists. Bioorg Med Chem Lett 24:2578-81 (2014)  
Target
Name:
Cytochrome P450 2D6
Synonyms:
CP2D6_HUMAN CYP2DL1 Cytochrome P450 2D6 (CYP2D6) P450-DB1
Type:
Protein
Mol. Mass.:
55774.82
Organism:
Homo sapiens (Human)
Description:
P10635
Residue:
497
  
Inhibitor
Name:
BDBM50014552
Synonyms:
CHEMBL3261483 | US9045501, 8
Type:
Small organic molecule
Emp. Form.:
C17H19ClN4O
Mol. Mass.:
330.812
SMILES:
Clc1cc2C(=O)N(CCn3ncc(c1)c23)[C@@H]1CN2CCC1CC2
: