Target
Apelin receptor
Ligand
BDBM50014627
Substrate
Meas. Tech.
ChEMBL_1347848 (CHEMBL3266750)
EC50
4.7±n/a nM
Citation
 Zhang, YMaitra, RHarris, DLDhungana, SSnyder, RRunyon, SP Identifying structural determinants of potency for analogs of apelin-13: integration of C-terminal truncation with structure-activity. Bioorg Med Chem 22:2992-7 (2014)  
Target
Name:
Apelin receptor
Synonyms:
AGTRL1 APJ_HUMAN Angiotensin receptor-like 1 Apelin receptor (APJ) G-protein coupled receptor HG11
Type:
Enzyme Catalytic Domain
Mol. Mass.:
42664.06
Organism:
Homo sapiens (Human)
Description:
P35414
Residue:
380
  
Inhibitor
Name:
BDBM50014627
Synonyms:
CHEMBL3261774
Type:
Small organic molecule
Emp. Form.:
C56H90N20O12
Mol. Mass.:
1235.4406
SMILES:
CC(C)C[C@H](NC(=O)[C@H](CCCNC(N)=N)NC(=O)[C@@H]1CCCN1C(=O)[C@H](CCCNC(N)=N)NC(C)=O)C(=O)N[C@@H](CO)C(=O)N[C@@H](Cc1cnc[nH]1)C(=O)N[C@@H](CCCCN)C(=O)NCC(=O)N1CCC[C@H]1C(=O)N[C@@H](Cc1ccccc1)C(N)=O
: