Target
Arylamine N-acetyltransferase 2
Ligand
BDBM50014913
Substrate
Meas. Tech.
ChEMBL_1347892 (CHEMBL3267128)
IC50
89000±n/a nM
Citation
 Egleton, JEThinnes, CCSeden, PTLaurieri, NLee, SPHadavizadeh, KSMeasures, ARJones, AMThompson, SVarney, AWynne, GMRyan, ASim, ERussell, AJ Structure-activity relationships and colorimetric properties of specific probes for the putative cancer biomarker human arylamine N-acetyltransferase 1. Bioorg Med Chem 22:3030-54 (2014)  
Target
Name:
Arylamine N-acetyltransferase 2
Synonyms:
AAC2 AT-2 N-acetyltransferase type 2 NAT2 Polymorphic arylamine N-acetyltransferase
Type:
PROTEIN
Mol. Mass.:
33829.75
Organism:
Mesocricetus auratus
Description:
ChEMBL_108305
Residue:
290
  
Inhibitor
Name:
BDBM50014913
Synonyms:
CHEMBL3262048
Type:
Small organic molecule
Emp. Form.:
C24H20N2O4S
Mol. Mass.:
432.492
SMILES:
Cc1cc(C)cc(NC2=C(NS(=O)(=O)c3ccccc3)C(=O)c3ccccc3C2=O)c1
: