Target
Kappa-type opioid receptor
Ligand
BDBM50015009
Substrate
Meas. Tech.
ChEMBL_1348091 (CHEMBL3269120)
Ki
0.100000±n/a nM
Citation
 Kumar, VRidzwan, IEGrivas, KLewis, JWClark, MJMeurice, CJimenez-Gomez, CPogozheva, IMosberg, HTraynor, JRHusbands, SM Selectively promiscuous opioid ligands: discovery of high affinity/low efficacy opioid ligands with substantial nociceptin opioid peptide receptor affinity. J Med Chem 57:4049-57 (2014)  
Target
Name:
Kappa-type opioid receptor
Synonyms:
K-OR-1 Kappa-opioid receptor (KOR) Kappa-type opioid receptor (KOR) OPIATE Kappa OPRK1 kappa opioid receptor (KOR)
Type:
G Protein-Coupled Receptor (GPCR)
Mol. Mass.:
42648.76
Organism:
Homo sapiens (Human)
Description:
P41145
Residue:
380
  
Inhibitor
Name:
BDBM50015009
Synonyms:
CHEMBL3262367 US9480684, 7a, R = 3,5- diMePh- BU10100
Type:
Small organic molecule
Emp. Form.:
C33H41NO4
Mol. Mass.:
515.6829
SMILES:
[H][C@@]12Oc3c4c(C[C@@]5([H])N(CC6CC6)CC[C@@]14[C@@]51CC[C@@]2(OC)[C@]([H])(C1)[C@](C)(O)c1cc(C)cc(C)c1)ccc3O
: