Target
P2Y purinoceptor 1
Ligand
BDBM50015287
Substrate
Meas. Tech.
ChEMBL_1349775 (CHEMBL3267607)
IC50
0.210000±n/a nM
Citation
 Hu, CHQiao, JXHan, YWang, TCHua, JPrice, LAWu, QShen, HHuang, CSRehfuss, RWexler, RRLam, PY 2-Amino-1,3,4-thiadiazoles in the 7-hydroxy-N-neopentyl spiropiperidine indolinyl series as potent P2Y1 receptor antagonists. Bioorg Med Chem Lett 24:2481-5 (2014)  
Target
Name:
P2Y purinoceptor 1
Synonyms:
ATP receptor P2RY1_HUMAN P2Y1 Purinergic receptor P2Y1
Type:
Enzyme
Mol. Mass.:
42090.25
Organism:
Homo sapiens (Human)
Description:
P47900
Residue:
373
  
Inhibitor
Name:
BDBM50015287
Synonyms:
CHEMBL3263067 | US9120798, 2
Type:
Small organic molecule
Emp. Form.:
C36H42F3N5OS
Mol. Mass.:
649.812
SMILES:
CC(C)(C)CN1CCC2(CN(c3c2c(ccc3O)C(F)(F)F)c2ccccc2Nc2nnc(s2)-c2ccc(cc2)C(C)(C)C)CC1
: