Target
Vitamin D3 receptor
Ligand
BDBM50015318
Substrate
Meas. Tech.
ChEMBL_1350563 (CHEMBL3270854)
EC50
0.400000±n/a nM
Citation
 Kudo, TIshizawa, MMaekawa, KNakabayashi, MWatarai, YUchida, HTokiwa, HIkura, TIto, NMakishima, MYamada, S Combination of triple bond and adamantane ring on the vitamin D side chain produced partial agonists for vitamin D receptor. J Med Chem 57:4073-87 (2014)  
Target
Name:
Vitamin D3 receptor
Synonyms:
1,25-dihydroxyvitamin D3 receptor Nuclear receptor subfamily 1 group I member 1 VDR | VDR_HUMAN
Type:
Protein
Mol. Mass.:
48288.72
Organism:
Homo sapiens (Human)
Description:
P11473
Residue:
427
  
Inhibitor
Name:
BDBM50015318
Synonyms:
CHEMBL3263871
Type:
Small organic molecule
Emp. Form.:
C35H50O3
Mol. Mass.:
518.7697
SMILES:
[H][C@@]1([#6]-[#6][C@@]2([H])\[#6](-[#6]-[#6]-[#6][C@]12[#6])=[#6]\[#6]=[#6]-1\[#6]-[#6@@H](-[#8])-[#6](=[#6])-[#6@H](-[#8])-[#6]-1)[#6@H](-[#6])-[#6]C#C[#6@@H](-[#8])C12[#6]-[#6]-3-[#6]-[#6](-[#6]-[#6](-[#6]-3)-[#6]1)-[#6]2
: