Target
Cytochrome P450 2C19
Ligand
BDBM50015448
Substrate
Meas. Tech.
ChEMBL_1348376 (CHEMBL3265580)
IC50
>10000±n/a nM
Citation
 Currie, KSKropf, JELee, TBlomgren, PXu, JZhao, ZGallion, SWhitney, JAMaclin, DLansdon, EBMaciejewski, PRossi, AMRong, HMacaluso, JBarbosa, JDi Paolo, JAMitchell, SA Discovery of GS-9973, a selective and orally efficacious inhibitor of spleen tyrosine kinase. J Med Chem 57:3856-73 (2014)  
Target
Name:
Cytochrome P450 2C19
Synonyms:
CP2CJ_HUMAN CYPIIC17 Cytochrome P450 2C19 (CYP2C19) Mephenytoin 4-hydroxylase P450-254C
Type:
Enzyme
Mol. Mass.:
55935.47
Organism:
Homo sapiens (Human)
Description:
P33261
Residue:
490
  
Inhibitor
Name:
BDBM50015448
Synonyms:
CHEMBL3265032
Type:
Small organic molecule
Emp. Form.:
C23H21N7O
Mol. Mass.:
411.4591
SMILES:
C1CN(CCO1)c1ccc(Nc2nc(cn3ccnc23)-c2ccc3cn[nH]c3c2)cc1
: