Target
Carbonic anhydrase 2
Ligand
BDBM10883
Substrate
Meas. Tech.
ChEMBL_1349990 (CHEMBL3270416)
Ki
38±n/a nM
Citation
 Nishimori, IVullo, DMinakuchi, TScozzafava, ACapasso, CSupuran, CT Sulfonamide inhibition studies of twoß-carbonic anhydrases from the bacterial pathogen Legionella pneumophila. Bioorg Med Chem 22:2939-46 (2014)  
Target
Name:
Carbonic anhydrase 2
Synonyms:
CA-II CAC Carbonate dehydratase II Carbonic anhydrase 2 (CA-II) Carbonic anhydrase C Carbonic anhydrase II (CA-II) Carbonic anhydrase II (hCA II) | Carbonic anhydrase isoenzyme II (hCA II)
Type:
Enzyme
Mol. Mass.:
29250.71
Organism:
Homo sapiens (Human)
Description:
P00918
Residue:
260
  
Inhibitor
Name:
BDBM10883
Synonyms:
4,5-dichlorobenzene-1,3-disulfonamide Dichlorophenamide Dichlorophenamide, DCP US10172837, Dichlorphenamide | sulfonamide 4
Type:
Small organic molecule
Emp. Form.:
C6H6Cl2N2O4S2
Mol. Mass.:
305.159
SMILES:
NS(=O)(=O)c1cc(Cl)c(Cl)c(c1)S(N)(=O)=O
: