Target
Sigma non-opioid intracellular receptor 1
Ligand
BDBM50016294
Substrate
Meas. Tech.
ChEMBL_1348915 (CHEMBL3271546)
Ki
6359±n/a nM
Citation
 Bai, SLi, SXu, JPeng, XSai, KChu, WTu, ZZeng, CMach, RH Synthesis and structure-activity relationship studies of conformationally flexible tetrahydroisoquinolinyl triazole carboxamide and triazole substituted benzamide analogues ass2 receptor ligands. J Med Chem 57:4239-51 (2014)  
Target
Name:
Sigma non-opioid intracellular receptor 1
Synonyms:
OPRS1 SIGMAR1 Sigma non-opioid intracellular receptor 1 Sigma1-receptor Sterol isomerase-like protein
Type:
Protein
Mol. Mass.:
25307.17
Organism:
Cavia porcellus (Guinea pig)
Description:
Q60492
Residue:
223
  
Inhibitor
Name:
BDBM50016294
Synonyms:
CHEMBL3262791
Type:
Small organic molecule
Emp. Form.:
C29H35N7O4
Mol. Mass.:
545.6327
SMILES:
COc1ccc(cc1C(=O)NCCCCN1CCc2cc(OC)c(OC)cc2C1)-n1cc(nn1)-c1cncn1C
: