Target
Prothrombin
Ligand
BDBM50010136
Substrate
Meas. Tech.
ChEMBL_1354679 (CHEMBL3281104)
IC50
10000±n/a nM
Citation
 Geratz, JDCheng, MCTidwell, RR Novel bis(benzamidino) compounds with an aromatic central link. Inhibitors of thrombin, pancreatic kallikrein, trypsin, and complement. J Med Chem 19:634-9 (1976)  
Target
Name:
Prothrombin
Synonyms:
Activation peptide fragment 1 Coagulation factor II Prothrombin precursor Thrombin heavy chain | Thrombin light chain
Type:
Protein
Mol. Mass.:
70029.57
Organism:
Homo sapiens (Human)
Description:
P00734
Residue:
622
  
Inhibitor
Name:
BDBM50010136
Synonyms:
CHEMBL3245422
Type:
Small organic molecule
Emp. Form.:
C28H24Br2N4O2
Mol. Mass.:
608.324
SMILES:
NC(=N)c1ccc(OCc2cccc(c2)-c2cccc(COc3ccc(cc3Br)C(N)=N)c2)c(Br)c1
: