Target
Acetylcholinesterase
Ligand
BDBM50016814
Substrate
Meas. Tech.
ChEMBL_1360666 (CHEMBL3282824)
pH
7±n/a
Ki
2000000±n/a nM
Comments
extracted
Citation
 Alspach, JDIngraham, LL Inhibition of acetylcholinesterase by thiamine. A structure-function study. J Med Chem 20:161-4 (1977)  
Target
Name:
Acetylcholinesterase
Synonyms:
ACES_ELEEL Acetylcholinesterase (EeAChE) | ache
Type:
Enzyme
Mol. Mass.:
71812.79
Organism:
Electrophorus electricus (Electric eel)
Description:
Residue:
633
  
Inhibitor
Name:
BDBM50016814
Synonyms:
CHEMBL3275138
Type:
Small organic molecule
Emp. Form.:
C6H9NS
Mol. Mass.:
127.207
SMILES:
CCc1scnc1C
: