Target
Carboxylic ester hydrolase
Ligand
BDBM50016864
Substrate
Meas. Tech.
ChEMBL_1355052 (CHEMBL3280466)
Ki
4800±n/a nM
Citation
 Chen, WSCocolas, GHCavallito, CJChai, KJ Potent reversible anticholinesterase agents. Bis- and mono-N-substituted benzoquinolinium halides. J Med Chem 20:1617-23 (1978)  
Target
Name:
Carboxylic ester hydrolase
Synonyms:
BuChE Butyrylcholine esterase Butyrylcholinesterase (BChE) Butyrylcholinesterase (EqBuChE) butyrylcholinesterase precursor
Type:
Protein
Mol. Mass.:
68842.83
Organism:
Equus caballus (Horse)
Description:
Q9N1N9
Residue:
602
  
Inhibitor
Name:
BDBM50016864
Synonyms:
CHEMBL3276415
Type:
Small organic molecule
Emp. Form.:
C16H16BrN
Mol. Mass.:
302.209
SMILES:
[Br-].CC(C)[n+]1cc2ccccc2c2ccccc12
: