Target
Melanocortin receptor 4
Ligand
BDBM50114745
Substrate
Meas. Tech.
ChEMBL_1365574 (CHEMBL3297283)
EC50
2.2±n/a nM
Citation
 Haslach, EMHuang, HDirain, MDebevec, GGeer, PSantos, RGGiulianotti, MAPinilla, CAppel, JRDoering, SRWalters, MAHoughten, RAHaskell-Luevano, C Identification of tetrapeptides from a mixture based positional scanning library that can restore nM full agonist function of the L106P, I69T, I102S, A219V, C271Y, and C271R human melanocortin-4 polymorphic receptors (hMC4Rs). J Med Chem 57:4615-28 (2014)  
Target
Name:
Melanocortin receptor 4
Synonyms:
MC4-R MC4R_HUMAN Melanocortin receptor 4 (MC-4) Melanocortin receptor 4 (MC4R)
Type:
Enzyme
Mol. Mass.:
36949.50
Organism:
Homo sapiens (Human)
Description:
P32245
Residue:
332
  
Inhibitor
Name:
BDBM50114745
Synonyms:
1N-{3-[1-[4-amino(imino)methylamino-1-[1-carbamoyl-2-(1H-3-indolyl)-(1S)-ethylcarbamoyl]-(1S)-butylcarbamoyl]-2-phenyl-(1R)-ethylcarbamoyl]-2-naphthyl}acetamide | CHEMBL405174
Type:
Small organic molecule
Emp. Form.:
C39H43N9O5
Mol. Mass.:
717.816
SMILES:
CC(=O)Nc1cc2ccccc2cc1C(=O)N[C@H](Cc1ccccc1)C(=O)N[C@@H](CCCNC(N)=N)C(=O)N[C@@H](Cc1c[nH]c2ccccc12)C(N)=O
: