Target
Delta-aminolevulinic acid dehydratase
Ligand
BDBM50017183
Substrate
Meas. Tech.
ChEMBL_1365623 (CHEMBL3297470)
IC50
197000±n/a nM
Citation
 Lentz, CSHalls, VSHannam, JSStrassel, SLawrence, SHJaffe, EKFamulok, MHoerauf, APfarr, KM wALADin benzimidazoles differentially modulate the function of porphobilinogen synthase orthologs. J Med Chem 57:2498-510 (2014)  
Target
Name:
Delta-aminolevulinic acid dehydratase
Synonyms:
ALAD HEM2_HUMAN | Porphobilinogen synthase
Type:
PROTEIN
Mol. Mass.:
36296.00
Organism:
Homo sapiens (Human)
Description:
ChEMBL_1365623
Residue:
330
  
Inhibitor
Name:
BDBM50017183
Synonyms:
CHEMBL3287359
Type:
Small organic molecule
Emp. Form.:
C16H11F3N2O2
Mol. Mass.:
320.2659
SMILES:
OC(=O)c1ccc2n(Cc3cccc(c3)C(F)(F)F)cnc2c1
: