Target
Delta-aminolevulinic acid dehydratase
Ligand
BDBM50441099
Substrate
Meas. Tech.
ChEMBL_1365972 (CHEMBL3296703)
IC50
79000±n/a nM
Citation
 Lentz, CSHalls, VSHannam, JSStrassel, SLawrence, SHJaffe, EKFamulok, MHoerauf, APfarr, KM wALADin benzimidazoles differentially modulate the function of porphobilinogen synthase orthologs. J Med Chem 57:2498-510 (2014)  
Target
Name:
Delta-aminolevulinic acid dehydratase
Synonyms:
ALAD HEM2_PSEAE | hemB
Type:
PROTEIN
Mol. Mass.:
37028.00
Organism:
Pseudomonas aeruginosa (strain ATCC 15692 / PAO1 / 1C / PRS 101 / LMG12228)
Description:
ChEMBL_108388
Residue:
337
  
Inhibitor
Name:
BDBM50441099
Synonyms:
CHEMBL2430574
Type:
Small organic molecule
Emp. Form.:
C23H18F3N3O3S
Mol. Mass.:
473.468
SMILES:
OC(=O)c1ccc2n(Cc3cccc(c3)C(F)(F)F)c(CCNC(=O)c3cccs3)nc2c1
: