Target
Delta-aminolevulinic acid dehydratase, chloroplastic
Ligand
BDBM50017188
Substrate
Meas. Tech.
ChEMBL_1365592 (CHEMBL3297373)
IC50
43100±n/a nM
Citation
 Lentz, CSHalls, VSHannam, JSStrassel, SLawrence, SHJaffe, EKFamulok, MHoerauf, APfarr, KM wALADin benzimidazoles differentially modulate the function of porphobilinogen synthase orthologs. J Med Chem 57:2498-510 (2014)  
Target
Name:
Delta-aminolevulinic acid dehydratase, chloroplastic
Synonyms:
ALAD HEM2_PEA | HEMB
Type:
PROTEIN
Mol. Mass.:
43811.42
Organism:
Pisum sativum
Description:
ChEMBL_108384
Residue:
398
  
Inhibitor
Name:
BDBM50017188
Synonyms:
CHEMBL3287364
Type:
Small organic molecule
Emp. Form.:
C16H11F3N2O2
Mol. Mass.:
320.2659
SMILES:
OC(=O)c1ccc2n(Cc3ccc(cc3)C(F)(F)F)cnc2c1
: