Target
Delta-aminolevulinic acid dehydratase, chloroplastic
Ligand
BDBM50017192
Substrate
Meas. Tech.
ChEMBL_1365592 (CHEMBL3297373)
IC50
155000±n/a nM
Citation
 Lentz, CSHalls, VSHannam, JSStrassel, SLawrence, SHJaffe, EKFamulok, MHoerauf, APfarr, KM wALADin benzimidazoles differentially modulate the function of porphobilinogen synthase orthologs. J Med Chem 57:2498-510 (2014)  
Target
Name:
Delta-aminolevulinic acid dehydratase, chloroplastic
Synonyms:
ALAD HEM2_PEA | HEMB
Type:
PROTEIN
Mol. Mass.:
43811.42
Organism:
Pisum sativum
Description:
ChEMBL_108384
Residue:
398
  
Inhibitor
Name:
BDBM50017192
Synonyms:
CHEMBL3287368
Type:
Small organic molecule
Emp. Form.:
C16H14N2O3
Mol. Mass.:
282.294
SMILES:
COc1cccc(Cn2cnc3cc(ccc23)C(O)=O)c1
: