Target
Interferon gamma
Ligand
BDBM50017346
Substrate
Meas. Tech.
ChEMBL_1363182 (CHEMBL3293897)
Kd
25000000±n/a nM
Citation
 Roy, SEl Hadri, ARichard, SDenis, FHolte, KDuffner, JYu, FGalcheva-Gargova, ZCapila, ISchultes, BPetitou, MKaundinya, GV Synthesis and biological evaluation of a unique heparin mimetic hexasaccharide for structure-activity relationship studies. J Med Chem 57:4511-20 (2014)  
Target
Name:
Interferon gamma
Synonyms:
IFN-gamma IFNG_HUMAN | Immune interferon
Type:
PROTEIN
Mol. Mass.:
19359.17
Organism:
Homo sapiens (Human)
Description:
ChEMBL_108375
Residue:
166
  
Inhibitor
Name:
BDBM50017346
Synonyms:
CHEMBL3288258
Type:
Small organic molecule
Emp. Form.:
C47H66N3Na9O52S6
Mol. Mass.:
1904.314
SMILES:
[Na+].[Na+].[Na+].[Na+].[Na+].[Na+].[Na+].[Na+].[Na+].[H][C@]1(O[C@@H]2O[C@@H](C([O-])=O)[C@@]([H])(O[C@H]3O[C@H](COS([O-])(=O)=O)[C@@]([H])(O[C@@H]4O[C@@H](C([O-])=O)[C@@]([H])(O[C@H]5O[C@H](COS([O-])(=O)=O)[C@@]([H])(O[C@@H]6O[C@H]([C@@H](O)[C@H](O)[C@H]6OS([O-])(=O)=O)C([O-])=O)[C@H](O)[C@H]5NC(C)=O)[C@H](O)[C@H]4OS([O-])(=O)=O)[C@H](O)[C@H]3NC(C)=O)[C@H](O)[C@H]2OS([O-])(=O)=O)[C@H](O)[C@@H](NC(C)=O)[C@@H](OCCCCC)O[C@@H]1COS([O-])(=O)=O
: