Target
Aromatic-L-amino-acid decarboxylase
Ligand
BDBM50017566
Substrate
Meas. Tech.
ChEMBL_1363990 (CHEMBL3295577)
IC50
1340000±n/a nM
Citation
 Cheng, PZhou, JQing, ZKang, WLiu, SLiu, WXie, HZeng, J Synthesis of 5-methyl phenanthridium derivatives: a new class of human DOPA decarboxylase inhibitors. Bioorg Med Chem Lett 24:2712-6 (2014)  
Target
Name:
Aromatic-L-amino-acid decarboxylase
Synonyms:
AADC DDC_HUMAN
Type:
PROTEIN
Mol. Mass.:
53931.80
Organism:
Homo sapiens (Human)
Description:
ChEMBL_83
Residue:
480
  
Inhibitor
Name:
BDBM50017566
Synonyms:
CHEBI:7578 | NITIDINE
Type:
Small organic molecule
Emp. Form.:
C21H18NO4
Mol. Mass.:
348.3714
SMILES:
COc1cc2c[n+](C)c3c(ccc4cc5OCOc5cc34)c2cc1OC
: