Target
Transient receptor potential cation channel subfamily V member 1
Ligand
BDBM50017592
Substrate
Meas. Tech.
ChEMBL_1363991 (CHEMBL3295578)
Ki
6.1±n/a nM
Citation
 Kim, HSJin, MKKang, SULim, JOTran, PTHoang, VHAnn, JHa, THPearce, LVPavlyukovets, VABlumberg, PMLee, J a-Methylated simplified resiniferatoxin (sRTX) thiourea analogues as potent and stereospecific TRPV1 antagonists. Bioorg Med Chem Lett 24:2685-8 (2014)  
Target
Name:
Transient receptor potential cation channel subfamily V member 1
Synonyms:
Capsaicin receptor TRPV1_RAT Trpv1 Vanilloid VR1 Vanilloid receptor 1 (VRI/TRPV1) Vanilloid receptor type 1-like (TrpV1/Vr1) Vr1l | osm-9-like TRP channel 1
Type:
Transient Receptor
Mol. Mass.:
94956.12
Organism:
Rattus norvegicus (rat)
Description:
O35433
Residue:
838
  
Inhibitor
Name:
BDBM50017592
Synonyms:
CHEMBL3288624
Type:
Small organic molecule
Emp. Form.:
C27H39N3O4S2
Mol. Mass.:
533.746
SMILES:
C[C@@H](NC(=S)NCC(COC(=O)C(C)(C)C)Cc1ccc(C)c(C)c1)c1ccc(NS(C)(=O)=O)cc1
: