Target
Integrase
Ligand
BDBM50009001
Substrate
Meas. Tech.
ChEMBL_1364393 (CHEMBL3294262)
IC50
780±n/a nM
Citation
 Li, BWZhang, FHSerrao, EChen, HSanchez, TWYang, LMNeamati, NZheng, YTWang, HLong, YQ Design and discovery of flavonoid-based HIV-1 integrase inhibitors targeting both the active site and the interaction with LEDGF/p75. Bioorg Med Chem 22:3146-58 (2014)  
Target
Name:
Integrase
Synonyms:
Human immunodeficiency virus type 1 integrase
Type:
PROTEIN
Mol. Mass.:
32231.48
Organism:
Human immunodeficiency virus 1
Description:
ChEMBL_90865
Residue:
288
  
Inhibitor
Name:
BDBM50009001
Synonyms:
5,6,7-Trihydroxyflavone Baicalein Baicalein, 8 US10252984, Table 2.33
Type:
Small organic molecule
Emp. Form.:
C15H10O5
Mol. Mass.:
270.2369
SMILES:
Oc1cc2oc(cc(=O)c2c(O)c1O)-c1ccccc1
: