Target
Protein kinase C alpha type
Ligand
BDBM50017889
Substrate
Meas. Tech.
ChEMBL_1364405 (CHEMBL3294517)
Ki
18±n/a nM
Citation
 Garcia, LCDonadío, LGMann, EKolusheva, SKedei, NLewin, NEHill, CSKelsey, JSYang, JEsch, TESantos, MPeach, MLKelley, JABlumberg, PMJelinek, RMarquez, VEComin, MJ Synthesis, biological, and biophysical studies of DAG-indololactones designed as selective activators of RasGRP. Bioorg Med Chem 22:3123-40 (2014)  
Target
Name:
Protein kinase C alpha type
Synonyms:
KPCA_HUMAN PKC alpha and beta-2 PKC-alpha PRKACA Protein Kinase C- alpha Protein kinase C alpha (PKCa) Protein kinase C alpha type (PRKCA) RAF proto-oncogene serine/threonine-protein kinase
Type:
Enzyme
Mol. Mass.:
76755.65
Organism:
Homo sapiens (Human)
Description:
The recombinant human PKC enzymes were produced using a baculovirus expression system in SF9 cells
Residue:
672
  
Inhibitor
Name:
BDBM50017889
Synonyms:
CHEMBL3289011
Type:
Small organic molecule
Emp. Form.:
C24H31NO5
Mol. Mass.:
413.5066
SMILES:
CCCC(CCC)C(=O)OCC1(CO)C\C(=C/c2cccc3n(C)ccc23)C(=O)O1
: