Target
D(4) dopamine receptor
Ligand
BDBM50384968
Substrate
Meas. Tech.
ChEMBL_1365238 (CHEMBL3292988)
Ki
31±n/a nM
Citation
 Sampson, DZhu, XYEyunni, SVEtukala, JROfori, EBricker, BLamango, NSSetola, VRoth, BLAblordeppey, SY Identification of a new selective dopamine D4 receptor ligand. Bioorg Med Chem 22:3105-14 (2014)  
Target
Name:
D(4) dopamine receptor
Synonyms:
D(4) dopamine receptor DOPAMINE D4.4 Dopamine receptor | Drd4
Type:
Enzyme Catalytic Domain
Mol. Mass.:
41307.65
Organism:
RAT
Description:
DOPAMINE D4.4 0 RAT::P30729
Residue:
387
  
Inhibitor
Name:
BDBM50384968
Synonyms:
CHEMBL2037430
Type:
Small organic molecule
Emp. Form.:
C20H22ClN3S
Mol. Mass.:
371.927
SMILES:
Clc1ccc(cc1)N1CCN(CCCc2nc3ccccc3s2)CC1
: