Target
D(1B) dopamine receptor
Ligand
BDBM50362864
Substrate
Meas. Tech.
ChEMBL_1365239 (CHEMBL3292989)
Ki
3223±n/a nM
Citation
 Sampson, DZhu, XYEyunni, SVEtukala, JROfori, EBricker, BLamango, NSSetola, VRoth, BLAblordeppey, SY Identification of a new selective dopamine D4 receptor ligand. Bioorg Med Chem 22:3105-14 (2014)  
Target
Name:
D(1B) dopamine receptor
Synonyms:
D(5) dopamine receptor DOPAMINE D5 DRD1L2 DRD5_HUMAN | dopamine receptor D5
Type:
Protein
Mol. Mass.:
52943.41
Organism:
Homo sapiens (Human)
Description:
P21918
Residue:
477
  
Inhibitor
Name:
BDBM50362864
Synonyms:
CHEMBL1940419
Type:
Small organic molecule
Emp. Form.:
C18H22FN3S
Mol. Mass.:
331.451
SMILES:
Fc1ccc(SCCCN2CCN(CC2)c2ccccn2)cc1
: