Target
D(1A) dopamine receptor
Ligand
BDBM50017988
Substrate
Meas. Tech.
ChEMBL_1365235 (CHEMBL3292985)
Ki
274±n/a nM
Citation
 Sampson, DZhu, XYEyunni, SVEtukala, JROfori, EBricker, BLamango, NSSetola, VRoth, BLAblordeppey, SY Identification of a new selective dopamine D4 receptor ligand. Bioorg Med Chem 22:3105-14 (2014)  
Target
Name:
D(1A) dopamine receptor
Synonyms:
DA D1 receptor DRD1 Dopamine D1 receptor Dopamine D1A
Type:
Enzyme
Mol. Mass.:
49303.43
Organism:
Homo sapiens (Human)
Description:
P21728
Residue:
446
  
Inhibitor
Name:
BDBM50017988
Synonyms:
CHEMBL3289655
Type:
Small organic molecule
Emp. Form.:
C22H25ClN2O
Mol. Mass.:
368.9
SMILES:
Clc1ccc(cc1)N1CCCN(CCCc2cc3ccccc3o2)CC1
: